Reaction Details
TargetVascular endothelial growth factor receptor 1
LigandBDBM50201394
Substrate/Competitorn/a
Meas. Tech.ChEMBL_453895 (CHEMBL885899)
IC50 87±n/a nM
Citation Kiselyov, ASPiatnitski, ELSamet, AVKisliy, VPSemenov, VV ortho-Substituted azoles as selective and dual inhibitors of VEGF receptors 1 and 2. Bioorg Med Chem Lett17:1369-75 (2007) 
 
Vascular endothelial growth factor receptor 1
Name:Vascular endothelial growth factor receptor 1
Type:Receptor Tyrosine Kinase
Mol. Mass.:150800.23
Organism:Homo sapiens (Human)
Description:P17948
Residue:1338
BDBM50201394
NameBDBM50201394
Synonyms:CHEMBL393779 | N-(4-tert-butylphenyl)-1-methyl-4-(pyridin-4-ylmethylamino)-1H-imidazole-5-carboxamide
TypeSmall organic molecule
Emp. Form.C21H25N5O
Mol. Mass.363.4561
SMILESCn1cnc(NCc2ccncc2)c1C(=O)Nc1ccc(cc1)C(C)(C)C