Reaction Details
TargetVascular endothelial growth factor receptor 2
LigandBDBM50201397
Substrate/Competitorn/a
Meas. Tech.ChEMBL_453897 (CHEMBL885901)
IC50 64±n/a nM
Citation Kiselyov, ASPiatnitski, ELSamet, AVKisliy, VPSemenov, VV ortho-Substituted azoles as selective and dual inhibitors of VEGF receptors 1 and 2. Bioorg Med Chem Lett17:1369-75 (2007) 
 
Vascular endothelial growth factor receptor 2
Name:Vascular endothelial growth factor receptor 2
Type:Receptor Tyrosine Kinase
Mol. Mass.:151510.97
Organism:Homo sapiens (Human)
Description:P35968
Residue:1356
BDBM50201397
NameBDBM50201397
Synonyms:1-methyl-N-(3-methyl-4-(trifluoromethyl)phenyl)-4-(pyridin-4-ylmethylamino)-1H-imidazole-5-carboxamide | CHEMBL238737
TypeSmall organic molecule
Emp. Form.C19H18F3N5O
Mol. Mass.389.3743
SMILESCc1cc(NC(=O)c2c(NCc3ccncc3)ncn2C)ccc1C(F)(F)F