Reaction Details
TargetVascular endothelial growth factor receptor 2
LigandBDBM50201363
Substrate/Competitorn/a
Meas. Tech.ChEMBL_453897 (CHEMBL885901)
IC50 64±n/a nM
Citation Kiselyov, ASPiatnitski, ELSamet, AVKisliy, VPSemenov, VV ortho-Substituted azoles as selective and dual inhibitors of VEGF receptors 1 and 2. Bioorg Med Chem Lett17:1369-75 (2007) 
 
Vascular endothelial growth factor receptor 2
Name:Vascular endothelial growth factor receptor 2
Type:Receptor Tyrosine Kinase
Mol. Mass.:151510.97
Organism:Homo sapiens (Human)
Description:P35968
Residue:1356
BDBM50201363
NameBDBM50201363
Synonyms:1-methyl-4-(pyridin-4-ylmethylamino)-N-(4-(trifluoromethoxy)phenyl)-1H-pyrazole-5-carboxamide | CHEMBL401040
TypeSmall organic molecule
Emp. Form.C18H16F3N5O2
Mol. Mass.391.3471
SMILESCn1ncc(NCc2ccncc2)c1C(=O)Nc1ccc(OC(F)(F)F)cc1