Reaction Details
TargetCarboxypeptidase N catalytic chain
LigandBDBM50201437
Substrate/Competitorn/a
Meas. Tech.ChEMBL_453906 (CHEMBL885910)
IC50 420±n/a nM
Citation Islam, IBryant, JMay, KMohan, RYuan, SKent, LMorser, JZhao, LVergona, RWhite, KAdler, MWhitlow, MBuckman, BO 3-Mercaptopropionic acids as efficacious inhibitors of activated thrombin activatable fibrinolysis inhibitor (TAFIa). Bioorg Med Chem Lett17:1349-54 (2007) 
 
Carboxypeptidase N catalytic chain
Name:Carboxypeptidase N catalytic chain
Type:PROTEIN
Mol. Mass.:52293.66
Organism:Homo sapiens (Human)
Description:ChEMBL_1496379
Residue:458
BDBM50201437
NameBDBM50201437
Synonyms:2-(mercaptomethyl)-3-(piperidin-3-yl)propanoic acid | CHEMBL395661
TypeSmall organic molecule
Emp. Form.C9H17NO2S
Mol. Mass.203.302
SMILESOC(=O)C(CS)CC1CCCNC1