Reaction Details
TargetCarboxypeptidase B2
LigandBDBM50201429
Substrate/Competitorn/a
Meas. Tech.ChEMBL_453904 (CHEMBL885908)
IC50 165±n/a nM
Citation Islam, IBryant, JMay, KMohan, RYuan, SKent, LMorser, JZhao, LVergona, RWhite, KAdler, MWhitlow, MBuckman, BO 3-Mercaptopropionic acids as efficacious inhibitors of activated thrombin activatable fibrinolysis inhibitor (TAFIa). Bioorg Med Chem Lett17:1349-54 (2007) 
 
Carboxypeptidase B2
Name:Carboxypeptidase B2
Type:Enzyme
Mol. Mass.:48432.74
Organism:Homo sapiens (Human)
Description:Q96IY4
Residue:423
BDBM50201429
NameBDBM50201429
Synonyms:2-(1-carbamimidoylpiperidin-3-yl)-3-mercaptopropanoic acid | CHEMBL245589
TypeSmall organic molecule
Emp. Form.C9H17N3O2S
Mol. Mass.231.315
SMILESNC(=N)N1CCCC(C1)C(CS)C(O)=O