Reaction Details
TargetCarboxypeptidase N catalytic chain
LigandBDBM50201430
Substrate/Competitorn/a
Meas. Tech.ChEMBL_453906 (CHEMBL885910)
IC50 1000±n/a nM
Citation Islam, IBryant, JMay, KMohan, RYuan, SKent, LMorser, JZhao, LVergona, RWhite, KAdler, MWhitlow, MBuckman, BO 3-Mercaptopropionic acids as efficacious inhibitors of activated thrombin activatable fibrinolysis inhibitor (TAFIa). Bioorg Med Chem Lett17:1349-54 (2007) 
 
Carboxypeptidase N catalytic chain
Name:Carboxypeptidase N catalytic chain
Type:PROTEIN
Mol. Mass.:52293.66
Organism:Homo sapiens (Human)
Description:ChEMBL_1496379
Residue:458
BDBM50201430
NameBDBM50201430
Synonyms:2-(4-carbamimidoylphenyl)-3-mercaptopropanoic acid | CHEMBL394951
TypeSmall organic molecule
Emp. Form.C10H12N2O2S
Mol. Mass.224.279
SMILESNC(=N)c1ccc(cc1)C(CS)C(O)=O