Reaction Details
TargetCarboxypeptidase B
LigandBDBM50201439
Substrate/Competitorn/a
Meas. Tech.ChEMBL_453905 (CHEMBL885909)
IC50 4650±n/a nM
Citation Islam, IBryant, JMay, KMohan, RYuan, SKent, LMorser, JZhao, LVergona, RWhite, KAdler, MWhitlow, MBuckman, BO 3-Mercaptopropionic acids as efficacious inhibitors of activated thrombin activatable fibrinolysis inhibitor (TAFIa). Bioorg Med Chem Lett17:1349-54 (2007) 
 
Carboxypeptidase B
Name:Carboxypeptidase B
Type:PROTEIN
Mol. Mass.:47371.10
Organism:Sus scrofa
Description:ChEMBL_453905
Residue:416
BDBM50201439
NameBDBM50201439
Synonyms:2-(2-chloro-5-guanidinophenyl)-3-mercaptopropanoic acid | CHEMBL245985
TypeSmall organic molecule
Emp. Form.C10H12ClN3O2S
Mol. Mass.273.739
SMILES[#7]\[#6](-[#7])=[#7]\c1ccc(Cl)c(c1)-[#6](-[#6]-[#16])-[#6](-[#8])=O