Reaction Details
TargetCarboxypeptidase B
LigandBDBM50201438
Substrate/Competitorn/a
Meas. Tech.ChEMBL_453905 (CHEMBL885909)
IC50 10±n/a nM
Citation Islam, IBryant, JMay, KMohan, RYuan, SKent, LMorser, JZhao, LVergona, RWhite, KAdler, MWhitlow, MBuckman, BO 3-Mercaptopropionic acids as efficacious inhibitors of activated thrombin activatable fibrinolysis inhibitor (TAFIa). Bioorg Med Chem Lett17:1349-54 (2007) 
 
Carboxypeptidase B
Name:Carboxypeptidase B
Type:PROTEIN
Mol. Mass.:47371.10
Organism:Sus scrofa
Description:ChEMBL_453905
Residue:416
BDBM50201438
NameBDBM50201438
Synonyms:(+/-)-5-guanidino-2-(mercaptomethyl)pentanoic acid CHEMBL236822
TypeSmall organic molecule
Emp. Form.C7H15N3O2S
Mol. Mass.205.278
SMILES[#7]\[#6](-[#7])=[#7]\[#6]-[#6]-[#6]-[#6](-[#6]-[#16])-[#6](-[#8])=O