Reaction Details
TargetMetabotropic glutamate receptor 5
LigandBDBM50201484
Substrate/Competitorn/a
Meas. Tech.ChEMBL_453908 (CHEMBL885912)
Ki 95±n/a nM
Citation Ceccarelli, SMJaeschke, GBuettelmann, BHuwyler, JKolczewski, SPeters, JUPrinssen, EPorter, RSpooren, WVieira, E Rational design, synthesis, and structure-activity relationship of benzoxazolones: new potent mglu5 receptor antagonists based on the fenobam structure. Bioorg Med Chem Lett17:1302-6 (2007) 
 
Metabotropic glutamate receptor 5
Name:Metabotropic glutamate receptor 5
Type:Enzyme
Mol. Mass.:132484.72
Organism:Homo sapiens (Human)
Description:n/a
Residue:1212
BDBM50201484
NameBDBM50201484
Synonyms:CHEMBL396691 | N-(6-methylpyridin-2-yl)-2-oxo-2,3-dihydrobenzo[d]oxazole-4-carboxamide
TypeSmall organic molecule
Emp. Form.C14H11N3O3
Mol. Mass.269.2554
SMILESCc1cccc(NC(=O)c2cccc3oc(=O)[nH]c23)n1