Reaction Details
TargetAdenosine kinase
LigandBDBM50201825
Substrate/Competitorn/a
Meas. Tech.ChEMBL_435461 (CHEMBL903819)
IC50 1±n/a nM
Citation Matulenko, MAPaight, ESFrey, RRGomtsyan, ADiDomenico, SJiang, MLee, CHStewart, AOYu, HKohlhaas, KLAlexander, KMMcGaraughty, SMikusa, JMarsh, KCMuchmore, SWJakob, CLKowaluk, EAJarvis, MFBhagwat, SS 4-amino-5-aryl-6-arylethynylpyrimidines: structure-activity relationships of non-nucleoside adenosine kinase inhibitors. Bioorg Med Chem15:1586-605 (2007) 
 
Adenosine kinase
Name:Adenosine kinase
Type:PROTEIN
Mol. Mass.:40545.97
Organism:Homo sapiens (Human)
Description:ChEMBL_1467841
Residue:362
BDBM50201825
NameBDBM50201825
Synonyms:5-(4-chlorophenyl)-6-{6-[(2-methoxyethyl)methylamino]pyridin-3-ylethynyl}pyrimidin-4-ylamine | CHEMBL225672
TypeSmall organic molecule
Emp. Form.C21H20ClN5O
Mol. Mass.393.869
SMILESCOCCN(C)c1ccc(cn1)C#Cc1ncnc(N)c1-c1ccc(Cl)cc1