Reaction Details
TargetProteinase-activated receptor 1
LigandBDBM50202075
Substrate/Competitorn/a
Meas. Tech.ChEMBL_423382 (CHEMBL909901)
IC50 147±n/a nM
Citation Clasby, MCChackalamannil, SCzarniecki, MDoller, DEagen, KGreenlee, WKao, GLin, YTsai, HXia, YAhn, HSAgans-Fantuzzi, JBoykow, GChintala, MFoster, CSmith-Torhan, AAlton, KBryant, MHsieh, YLau, JPalamanda, J Metabolism-based identification of a potent thrombin receptor antagonist. J Med Chem50:129-38 (2007) 
 
Proteinase-activated receptor 1
Name:Proteinase-activated receptor 1
Type:Protein
Mol. Mass.:47450.07
Organism:Homo sapiens (Human)
Description:P25116
Residue:425
BDBM50202075
NameBDBM50202075
Synonyms:(3R,3aS,4S,4aR,7R,8aR,9aR)-decahydro-7-hydroxy-3-methyl-4-[(E)-2-[5-(3-methylphenyl)-2-pyridinyl]ethenyl]naphtho[2,3-c]furan-1(3H)-one | CHEMBL219282
TypeSmall organic molecule
Emp. Form.C27H31NO3
Mol. Mass.417.5399
SMILESC[C@H]1OC(=O)[C@@H]2C[C@@H]3C[C@H](O)CC[C@H]3[C@H](\C=C\c3ccc(cn3)-c3cccc(C)c3)[C@H]12