Reaction Details
Target11-beta-hydroxysteroid dehydrogenase 1
LigandBDBM50202098
Substrate/Competitorn/a
Meas. Tech.ChEMBL_423355 (CHEMBL909896)
Ki 110±n/a nM
Citation Rohde, JJPliushchev, MASorensen, BKWodka, DShuai, QWang, JFung, SMonzon, KMChiou, WJPan, LDeng, XChovan, LERamaiya, AMullally, MHenry, RFStolarik, DFImade, HMMarsh, KCBeno, DWFey, TADroz, BABrune, MECamp, HSSham, HLFrevert, EUJacobson, PBLink, JT Discovery and metabolic stabilization of potent and selective 2-amino-N-(adamant-2-yl) acetamide 11beta-hydroxysteroid dehydrogenase type 1 inhibitors. J Med Chem50:149-64 (2007) 
 
11-beta-hydroxysteroid dehydrogenase 1
Name:11-beta-hydroxysteroid dehydrogenase 1
Type:Enzyme
Mol. Mass.:32369.70
Organism:Mus musculus (mouse)
Description:P50172
Residue:292
BDBM50202098
NameBDBM50202098
Synonyms:CHEMBL218143 | N-(1-hydroxy-adamantan-2-yl)-2-[4-(5-trifluoromethyl-pyridin-2-yl)-piperazin-1-yl]-acetamide
TypeSmall organic molecule
Emp. Form.C22H29F3N4O2
Mol. Mass.438.4865
SMILESOC12CC3CC(CC(C3)C1NC(=O)CN1CCN(CC1)c1ccc(cn1)C(F)(F)F)C2