Reaction Details
Target11-beta-hydroxysteroid dehydrogenase 1
LigandBDBM50202093
Substrate/Competitorn/a
Meas. Tech.ChEMBL_423354 (CHEMBL909895)
Ki 5±n/a nM
Citation Rohde, JJPliushchev, MASorensen, BKWodka, DShuai, QWang, JFung, SMonzon, KMChiou, WJPan, LDeng, XChovan, LERamaiya, AMullally, MHenry, RFStolarik, DFImade, HMMarsh, KCBeno, DWFey, TADroz, BABrune, MECamp, HSSham, HLFrevert, EUJacobson, PBLink, JT Discovery and metabolic stabilization of potent and selective 2-amino-N-(adamant-2-yl) acetamide 11beta-hydroxysteroid dehydrogenase type 1 inhibitors. J Med Chem50:149-64 (2007) 
 
11-beta-hydroxysteroid dehydrogenase 1
Name:11-beta-hydroxysteroid dehydrogenase 1
Type:Enzyme
Mol. Mass.:32409.16
Organism:Homo sapiens (Human)
Description:P28845
Residue:292
BDBM50202093
NameBDBM50202093
Synonyms:2-[3-(2-fluoro-phenoxy)-azetidin-1-yl]-N-(5-hydroxy-adamantan-2-yl)-propionamide | CHEMBL217917
TypeSmall organic molecule
Emp. Form.C22H29FN2O3
Mol. Mass.388.4757
SMILESCC(N1CC(C1)Oc1ccccc1F)C(=O)N[C@H]1C2CC3CC1C[C@](O)(C3)C2