Reaction Details
TargetDelta-type opioid receptor
LigandBDBM50202114
Substrate/Competitorn/a
Meas. Tech.ChEMBL_423418 (CHEMBL911093)
Ki 1.1±n/a nM
Citation Lee, YSAgnes, RSDavis, PMa, SWBadghisi, HLai, JPorreca, FHruby, VJ Partial retro-inverso, retro, and inverso modifications of hydrazide linked bifunctional peptides for opioid and cholecystokinin (CCK) receptors. J Med Chem50:165-8 (2007) 
 
Delta-type opioid receptor
Name:Delta-type opioid receptor
Type:G Protein-Coupled Receptor (GPCR)
Mol. Mass.:40382.98
Organism:Homo sapiens (Human)
Description:Competition binding assays were carried out using membrane preparations from transfected HN9.10 cells that constitutively expressed the delta opioid receptor.
Residue:372
BDBM50202114
NameBDBM50202114
Synonyms:CHEMBL386212 | H-Tyr-D-Ala-Gly-Phe-NH-NH-D-Trp-Nle-Asp-Phe-H
TypeSmall organic molecule
Emp. Form.C53H65N11O11
Mol. Mass.1032.1503
SMILESCCCC[C@H](NC(=O)[C@H](CC(O)=O)NC(=O)[C@@H](N)Cc1ccccc1)C(=O)N[C@H](Cc1cc2ccccc2[nH]1)C(=O)NNC(=O)[C@H](Cc1ccccc1)NC(=O)CNC(=O)[C@@H](C)NC(=O)[C@@H](N)Cc1ccc(O)cc1