Reaction Details
TargetReceptor-type tyrosine-protein kinase FLT3
LigandBDBM50202212
Substrate/Competitorn/a
Meas. Tech.ChEMBL_435529 (CHEMBL903889)
IC50>30000±n/a nM
Citation Mahboobi, SUecker, ACénac, CSellmer, AEichhorn, EElz, SBöhmer, FDDove, S Inhibition of FLT3 and PDGFR tyrosine kinase activity by bis(benzo[b]furan-2-yl)methanones. Bioorg Med Chem15:2187-97 (2007) 
 
Receptor-type tyrosine-protein kinase FLT3
Name:Receptor-type tyrosine-protein kinase FLT3
Type:Enzyme
Mol. Mass.:112888.62
Organism:Homo sapiens (Human)
Description:P36888
Residue:993
BDBM50202212
NameBDBM50202212
Synonyms:CHEMBL389233 | bis(4-methoxybenzo[b]furan-2-yl)methanone
TypeSmall organic molecule
Emp. Form.C19H14O5
Mol. Mass.322.3115
SMILESCOc1cccc2oc(cc12)C(=O)c1cc2c(OC)cccc2o1