Reaction Details
TargetReceptor-type tyrosine-protein kinase FLT3
LigandBDBM50202215
Substrate/Competitorn/a
Meas. Tech.ChEMBL_435529 (CHEMBL903889)
IC50 400±n/a nM
Citation Mahboobi, SUecker, ACénac, CSellmer, AEichhorn, EElz, SBöhmer, FDDove, S Inhibition of FLT3 and PDGFR tyrosine kinase activity by bis(benzo[b]furan-2-yl)methanones. Bioorg Med Chem15:2187-97 (2007) 
 
Receptor-type tyrosine-protein kinase FLT3
Name:Receptor-type tyrosine-protein kinase FLT3
Type:Enzyme
Mol. Mass.:112888.62
Organism:Homo sapiens (Human)
Description:P36888
Residue:993
BDBM50202215
NameBDBM50202215
Synonyms:(benzo[b]furan-2-yl)-(1H-indol-2-yl)methanone | CHEMBL226183
TypeSmall organic molecule
Emp. Form.C17H11NO2
Mol. Mass.261.2747
SMILESO=C(c1cc2ccccc2[nH]1)c1cc2ccccc2o1