Reaction Details
TargetReceptor-type tyrosine-protein kinase FLT3
LigandBDBM50202210
Substrate/Competitorn/a
Meas. Tech.ChEMBL_435529 (CHEMBL903889)
IC50 3600±n/a nM
Citation Mahboobi, SUecker, ACénac, CSellmer, AEichhorn, EElz, SBöhmer, FDDove, S Inhibition of FLT3 and PDGFR tyrosine kinase activity by bis(benzo[b]furan-2-yl)methanones. Bioorg Med Chem15:2187-97 (2007) 
 
Receptor-type tyrosine-protein kinase FLT3
Name:Receptor-type tyrosine-protein kinase FLT3
Type:Enzyme
Mol. Mass.:112888.62
Organism:Homo sapiens (Human)
Description:P36888
Residue:993
BDBM50202210
NameBDBM50202210
Synonyms:CHEMBL225826 | bis(5-hydroxybenzo[b]furan-2-yl)methanone
TypeSmall organic molecule
Emp. Form.C17H10O5
Mol. Mass.294.2583
SMILESOc1ccc2oc(cc2c1)C(=O)c1cc2cc(O)ccc2o1