Reaction Details
TargetC-X-C chemokine receptor type 4
LigandBDBM50202357
Substrate/Competitorn/a
Meas. Tech.ChEMBL_423498 (CHEMBL911131)
IC50 130±n/a nM
Citation Ueda, SOishi, SWang, ZXAraki, TTamamura, HCluzeau, JOhno, HKusano, SNakashima, HTrent, JOPeiper, SCFujii, N Structure-activity relationships of cyclic peptide-based chemokine receptor CXCR4 antagonists: disclosing the importance of side-chain and backbone functionalities. J Med Chem50:192-8 (2007) 
 
C-X-C chemokine receptor type 4
Name:C-X-C chemokine receptor type 4
Type:Enzyme
Mol. Mass.:39754.61
Organism:Homo sapiens (Human)
Description:P61073
Residue:352
BDBM50202357
NameBDBM50202357
Synonyms:CHEMBL373440 | cyclo(-D-Ala-D-Arg-L-Arg-L-Nal-Gly-)
TypeSmall organic molecule
Emp. Form.C30H43N11O5
Mol. Mass.637.7331
SMILES[#6]-[#6@H]-1-[#7]-[#6](=O)-[#6@@H](-[#6]-[#6]-[#6]\[#7]=[#6](\[#7])-[#7])-[#7]-[#6](=O)-[#6@H](-[#6]-[#6]-[#6]\[#7]=[#6](\[#7])-[#7])-[#7]-[#6](=O)-[#6@H](-[#6]-c2ccc3ccccc3c2)-[#7]-[#6](=O)-[#6]-[#7]-[#6]-1=O