Reaction Details
TargetB1 bradykinin receptor
LigandBDBM50202414
Substrate/Competitorn/a
Meas. Tech.ChEMBL_423668 (CHEMBL913433)
Ki 1.35±n/a nM
Citation Kuduk, SDDi Marco, CNChang, RKWood, MRSchirripa, KMKim, JJWai, JMDiPardo, RMMurphy, KLRansom, RWHarrell, CMReiss, DRHolahan, MACook, JHess, JFSain, NUrban, MOTang, CPrueksaritanont, TPettibone, DJBock, MG Development of orally bioavailable and CNS penetrant biphenylaminocyclopropane carboxamide bradykinin B1 receptor antagonists. J Med Chem50:272-82 (2007) 
 
B1 bradykinin receptor
Name:B1 bradykinin receptor
Type:Enzyme
Mol. Mass.:40508.87
Organism:Homo sapiens (Human)
Description:P46663
Residue:353
BDBM50202414
NameBDBM50202414
Synonyms:CHEMBL218553 | ethyl 3-chloro-3'-fluoro-4'-{(1R)-1-[({1-[(trifluoroacetyl)amino]cyclopropyl}carbonyl)amino]ethyl}-1,1'-biphenyl-2-carboxylate
TypeSmall organic molecule
Emp. Form.C23H21ClF4N2O4
Mol. Mass.500.87
SMILESCCOC(=O)c1c(Cl)cccc1-c1ccc([C@@H](C)NC(=O)C2(CC2)NC(=O)C(F)(F)F)c(F)c1