Reaction Details
TargetB1 bradykinin receptor
LigandBDBM50202427
Substrate/Competitorn/a
Meas. Tech.ChEMBL_423668 (CHEMBL913433)
Ki 0.93±n/a nM
Citation Kuduk, SDDi Marco, CNChang, RKWood, MRSchirripa, KMKim, JJWai, JMDiPardo, RMMurphy, KLRansom, RWHarrell, CMReiss, DRHolahan, MACook, JHess, JFSain, NUrban, MOTang, CPrueksaritanont, TPettibone, DJBock, MG Development of orally bioavailable and CNS penetrant biphenylaminocyclopropane carboxamide bradykinin B1 receptor antagonists. J Med Chem50:272-82 (2007) 
 
B1 bradykinin receptor
Name:B1 bradykinin receptor
Type:Enzyme
Mol. Mass.:40508.87
Organism:Homo sapiens (Human)
Description:P46663
Residue:353
BDBM50202427
NameBDBM50202427
Synonyms:CHEMBL221288 | methyl 4'-[(1R)-1-({[1-(acetylamino)cyclopropyl]carbonyl}-amino)ethyl]-3,3'-difluoro-1,1'-biphenyl-2-carboxylate
TypeSmall organic molecule
Emp. Form.C22H22F2N2O4
Mol. Mass.416.4179
SMILESCOC(=O)c1c(F)cccc1-c1ccc([C@@H](C)NC(=O)C2(CC2)NC(C)=O)c(F)c1