Reaction Details
TargetB1 bradykinin receptor
LigandBDBM50202423
Substrate/Competitorn/a
Meas. Tech.ChEMBL_423668 (CHEMBL913433)
Ki 1.44±n/a nM
Citation Kuduk, SDDi Marco, CNChang, RKWood, MRSchirripa, KMKim, JJWai, JMDiPardo, RMMurphy, KLRansom, RWHarrell, CMReiss, DRHolahan, MACook, JHess, JFSain, NUrban, MOTang, CPrueksaritanont, TPettibone, DJBock, MG Development of orally bioavailable and CNS penetrant biphenylaminocyclopropane carboxamide bradykinin B1 receptor antagonists. J Med Chem50:272-82 (2007) 
 
B1 bradykinin receptor
Name:B1 bradykinin receptor
Type:Enzyme
Mol. Mass.:40508.87
Organism:Homo sapiens (Human)
Description:P46663
Residue:353
BDBM50202423
NameBDBM50202423
Synonyms:CHEMBL221695 | N-{(1R)-1-[3,3'-difluoro-2'-(trifluoromethyl)-1,1'-biphenyl-4-yl]ethyl}-1-[(trifluoroacetyl)amino]cyclopropanecarboxamide
TypeSmall organic molecule
Emp. Form.C21H16F8N2O2
Mol. Mass.480.3512
SMILESC[C@@H](NC(=O)C1(CC1)NC(=O)C(F)(F)F)c1ccc(cc1F)-c1cccc(F)c1C(F)(F)F