Reaction Details
TargetB1 bradykinin receptor
LigandBDBM50202409
Substrate/Competitorn/a
Meas. Tech.ChEMBL_423671 (CHEMBL912896)
IC50 0.89±n/a nM
Citation Kuduk, SDDi Marco, CNChang, RKWood, MRSchirripa, KMKim, JJWai, JMDiPardo, RMMurphy, KLRansom, RWHarrell, CMReiss, DRHolahan, MACook, JHess, JFSain, NUrban, MOTang, CPrueksaritanont, TPettibone, DJBock, MG Development of orally bioavailable and CNS penetrant biphenylaminocyclopropane carboxamide bradykinin B1 receptor antagonists. J Med Chem50:272-82 (2007) 
 
B1 bradykinin receptor
Name:B1 bradykinin receptor
Type:Enzyme
Mol. Mass.:40508.87
Organism:Homo sapiens (Human)
Description:P46663
Residue:353
BDBM50202409
NameBDBM50202409
Synonyms:CHEMBL218605 | N-{(1R)-1-[3,3'-difluoro-2'-(3-methyl-1,2,4-oxadiazol-5-yl)-1,1'-biphenyl-4-yl]ethyl}-1-[(trifluoroacetyl)amino]cyclopropanecarboxamide
TypeSmall organic molecule
Emp. Form.C23H19F5N4O3
Mol. Mass.494.414
SMILESC[C@@H](NC(=O)C1(CC1)NC(=O)C(F)(F)F)c1ccc(cc1F)-c1cccc(F)c1-c1nc(C)no1