Reaction Details
TargetPeroxisome proliferator-activated receptor alpha
LigandBDBM50202581
Substrate/Competitorn/a
Meas. Tech.ChEMBL_423813 (CHEMBL911274)
EC50>10000000±n/a nM
Citation Cano, CPavón, JSerrano, AGoya, PPaez, JAde Fonseca, FRMacias-Gonzalez, M Novel sulfamide analogs of oleoylethanolamide showing in vivo satiety inducing actions and PPARalpha activation. J Med Chem50:389-93 (2007) 
 
Peroxisome proliferator-activated receptor alpha
Name:Peroxisome proliferator-activated receptor alpha
Type:Enzyme
Mol. Mass.:52222.08
Organism:Homo sapiens (Human)
Description:Q07869
Residue:468
BDBM50202581
NameBDBM50202581
Synonyms:CHEMBL218795 | N-hexadecylsulfamide
TypeSmall organic molecule
Emp. Form.C16H36N2O2S
Mol. Mass.320.534
(N)(=O)=O