Reaction Details
TargetMelanin-concentrating hormone receptor 1
LigandBDBM50202675
Substrate/Competitorn/a
Meas. Tech.ChEMBL_421700 (CHEMBL854908)
IC50 7±n/a nM
Citation Iyengar, RRLynch, JKMulhern, MMJudd, ASFreeman, JCGao, JSouers, AJZhao, GWodka, DDoug Falls, HBrodjian, SDayton, BDReilly, RMSwanson, SSu, ZMartin, RLLeitza, STHouseman, KADiaz, GCollins, CASham, HLKym, PR An evaluation of 3,4-methylenedioxy phenyl replacements in the aminopiperidine chromone class of MCHr1 antagonists. Bioorg Med Chem Lett17:874-8 (2007) 
 
Melanin-concentrating hormone receptor 1
Name:Melanin-concentrating hormone receptor 1
Type:G Protein-Coupled Receptor (GPCR)
Mol. Mass.:45976.27
Organism:Homo sapiens (Human)
Description:Membranes from CHO-K1 cells stably expressing human MCH1R were used in assays.
Residue:422
BDBM50202675
NameBDBM50202675
Synonyms:7-fluoro-4-oxo-N-(1-((2-oxo-1,2-dihydroquinolin-7-yl)methyl)piperidin-4-yl)-4H-chromene-2-carboxamide | CHEMBL216482
TypeSmall organic molecule
Emp. Form.C25H22FN3O4
Mol. Mass.447.4583
SMILESFc1ccc2c(c1)oc(cc2=O)C(=O)NC1CCN(Cc2ccc3ccc(=O)[nH]c3c2)CC1