Reaction Details
TargetTyrosine-protein kinase Fgr
LigandBDBM50202734
Substrate/Competitorn/a
Meas. Tech.ChEMBL_446811 (CHEMBL897110)
IC50 14100±n/a nM
Citation Abbott, LBetschmann, PBurchat, ACalderwood, DJDavis, HHrnciar, PHirst, GCLi, BMorytko, MMullen, KYang, B Discovery of thienopyridines as Src-family selective Lck inhibitors. Bioorg Med Chem Lett17:1167-71 (2007) 
 
Tyrosine-protein kinase Fgr
Name:Tyrosine-protein kinase Fgr
Type:protein
Mol. Mass.:59469.88
Organism:Homo sapiens (Human)
Description:P09769
Residue:529
BDBM50202734
NameBDBM50202734
Synonyms:CHEMBL232542 | N-(4-(4-amino-7-(3-(diethylamino)prop-1-enyl)thieno[3,2-c]pyridin-3-yl)-2-methoxyphenyl)-1-methyl-1H-indole-2-carboxamide
TypeSmall organic molecule
Emp. Form.C31H33N5O2S
Mol. Mass.539.691
SMILESCCN(CC)C\C=C\c1cnc(N)c2c(csc12)-c1ccc(NC(=O)c2cc3ccccc3n2C)c(OC)c1