Reaction Details
TargetTyrosine-protein kinase Fgr
LigandBDBM50202741
Substrate/Competitorn/a
Meas. Tech.ChEMBL_446811 (CHEMBL897110)
IC50 37900±n/a nM
Citation Abbott, LBetschmann, PBurchat, ACalderwood, DJDavis, HHrnciar, PHirst, GCLi, BMorytko, MMullen, KYang, B Discovery of thienopyridines as Src-family selective Lck inhibitors. Bioorg Med Chem Lett17:1167-71 (2007) 
 
Tyrosine-protein kinase Fgr
Name:Tyrosine-protein kinase Fgr
Type:protein
Mol. Mass.:59469.88
Organism:Homo sapiens (Human)
Description:P09769
Residue:529
BDBM50202741
NameBDBM50202741
Synonyms:CHEMBL233958 | N-(4-(4-amino-7-(3-(4-hydroxypiperidin-1-yl)prop-1-enyl)thieno[3,2-c]pyridin-3-yl)-2-methoxyphenyl)-1-methyl-1H-indole-2-carboxamide
TypeSmall organic molecule
Emp. Form.C32H33N5O3S
Mol. Mass.567.701
SMILESCOc1cc(ccc1NC(=O)c1cc2ccccc2n1C)-c1csc2c(\C=C\CN3CCC(O)CC3)cnc(N)c12