Reaction Details
TargetAdenosine receptor A2a
LigandBDBM50202771
Substrate/Competitorn/a
Meas. Tech.ChEMBL_454055 (CHEMBL903246)
Ki 0.4±n/a nM
Citation Silverman, LSCaldwell, JPGreenlee, WJKiselgof, EMatasi, JJTulshian, DBArik, LFoster, CBertorelli, RMonopoli, AOngini, E 3H-[1,2,4]-Triazolo[5,1-i]purin-5-amine derivatives as adenosine A2A antagonists. Bioorg Med Chem Lett17:1659-62 (2007) 
 
Adenosine receptor A2a
Name:Adenosine receptor A2a
Type:G Protein-Coupled Receptor (GPCR)
Mol. Mass.:44716.46
Organism:Homo sapiens (Human)
Description:P29274
Residue:412
BDBM50202771
NameBDBM50202771
Synonyms:8-(furan-2-yl)-3-(2-(4-(4-(2-methoxyethoxy)-2-(trifluoromethyl)phenyl)piperazin-1-yl)ethyl)-3H-[1,2,4]triazolo[1,5-g]purin-5-amine | CHEMBL391953
TypeSmall organic molecule
Emp. Form.C26H28F3N9O3
Mol. Mass.571.5542
SMILESCOCCOc1ccc(N2CCN(CCn3cnc4c3nc(N)n3nc(nc43)-c3ccco3)CC2)c(c1)C(F)(F)F