Reaction Details
TargetAdenosine receptor A2a
LigandBDBM50202774
Substrate/Competitorn/a
Meas. Tech.ChEMBL_454055 (CHEMBL903246)
Ki 4.6±n/a nM
Citation Silverman, LSCaldwell, JPGreenlee, WJKiselgof, EMatasi, JJTulshian, DBArik, LFoster, CBertorelli, RMonopoli, AOngini, E 3H-[1,2,4]-Triazolo[5,1-i]purin-5-amine derivatives as adenosine A2A antagonists. Bioorg Med Chem Lett17:1659-62 (2007) 
 
Adenosine receptor A2a
Name:Adenosine receptor A2a
Type:G Protein-Coupled Receptor (GPCR)
Mol. Mass.:44716.46
Organism:Homo sapiens (Human)
Description:P29274
Residue:412
BDBM50202774
NameBDBM50202774
Synonyms:3-(2-bromobenzyl)-8-(furan-2-yl)-3H-[1,2,4]triazolo[1,5-g]purin-5-amine | CHEMBL245646
TypeSmall organic molecule
Emp. Form.C17H12BrN7O
Mol. Mass.410.227
SMILESNc1nc2n(Cc3ccccc3Br)cnc2c2nc(nn12)-c1ccco1