Reaction Details
TargetAdenosine receptor A2a
LigandBDBM50202778
Substrate/Competitorn/a
Meas. Tech.ChEMBL_454055 (CHEMBL903246)
Ki 89.7±n/a nM
Citation Silverman, LSCaldwell, JPGreenlee, WJKiselgof, EMatasi, JJTulshian, DBArik, LFoster, CBertorelli, RMonopoli, AOngini, E 3H-[1,2,4]-Triazolo[5,1-i]purin-5-amine derivatives as adenosine A2A antagonists. Bioorg Med Chem Lett17:1659-62 (2007) 
 
Adenosine receptor A2a
Name:Adenosine receptor A2a
Type:G Protein-Coupled Receptor (GPCR)
Mol. Mass.:44716.46
Organism:Homo sapiens (Human)
Description:P29274
Residue:412
BDBM50202778
NameBDBM50202778
Synonyms:3-(2-{4-[4-(2-methoxy-ethoxy)-phenyl]-piperazin-1-yl}-ethyl)-8-(1-oxy-pyridin-2-yl)-3H-[1,2,4]triazolo[5,1-i]purin-5-ylamine | CHEMBL392386
TypeSmall organic molecule
Emp. Form.C26H30N10O3
Mol. Mass.530.5816
SMILESCOCCOc1ccc(cc1)N1CCN(CCn2cnc3c2nc(N)n2nc(nc32)-c2cccc[n+]2[O-])CC1