Reaction Details
TargetAdenosine receptor A2a
LigandBDBM50202785
Substrate/Competitorn/a
Meas. Tech.ChEMBL_454055 (CHEMBL903246)
Ki 3.7±n/a nM
Citation Silverman, LSCaldwell, JPGreenlee, WJKiselgof, EMatasi, JJTulshian, DBArik, LFoster, CBertorelli, RMonopoli, AOngini, E 3H-[1,2,4]-Triazolo[5,1-i]purin-5-amine derivatives as adenosine A2A antagonists. Bioorg Med Chem Lett17:1659-62 (2007) 
 
Adenosine receptor A2a
Name:Adenosine receptor A2a
Type:G Protein-Coupled Receptor (GPCR)
Mol. Mass.:44716.46
Organism:Homo sapiens (Human)
Description:P29274
Residue:412
BDBM50202785
NameBDBM50202785
Synonyms:3-(2-(4-(4-(2-methoxyethoxy)phenyl)piperazin-1-yl)ethyl)-8-phenyl-3H-[1,2,4]triazolo[1,5-g]purin-5-amine | CHEMBL246468
TypeSmall organic molecule
Emp. Form.C27H31N9O2
Mol. Mass.513.5941
SMILESCOCCOc1ccc(cc1)N1CCN(CCn2cnc3c4nc(nn4c(N)nc23)-c2ccccc2)CC1