Reaction Details
TargetVasopressin V1a receptor
LigandBDBM50202858
Substrate/Competitorn/a
Meas. Tech.ChEMBL_441650 (CHEMBL891881)
Ki 1.13±n/a nM
Citation Guillon, CDKoppel, GABrownstein, MJChaney, MOFerris, CFLu, SFFabio, KMMiller, MJHeindel, NDHunden, DCCooper, RDKaldor, SWSkelton, JJDressman, BAClay, MPSteinberg, MIBruns, RFSimon, NG Azetidinones as vasopressin V1a antagonists. Bioorg Med Chem15:2054-80 (2007) 
 
Vasopressin V1a receptor
Name:Vasopressin V1a receptor
Type:Receptor
Mol. Mass.:46820.18
Organism:Homo sapiens (Human)
Description:P37288
Residue:418
BDBM50202858
NameBDBM50202858
Synonyms:2(R)-[[4-(piperidin-1-yl)piperidin-1-yl]carbonylmethyl]-2-[3(S)-(4(S)-phenyloxazolidin-2-on-3-yl)-4(R)-(2-styryl)azetidin-2-on-1-yl]acetic acid N-(2-fluoro-3-tri-fluoromethylbenzyl)amide | CHEMBL397025
TypeSmall organic molecule
Emp. Form.C42H45F4N5O5
Mol. Mass.775.8308
SMILESFc1c(CNC(=O)[C@H](CC(=O)N2CCC(CC2)N2CCCCC2)N2[C@H](\C=C\c3ccccc3)[C@H](N3[C@H](COC3=O)c3ccccc3)C2=O)cccc1C(F)(F)F