Reaction Details
TargetAdenosine receptor A2a
LigandBDBM50202990
Substrate/Competitorn/a
Meas. Tech.ChEMBL_454087 (CHEMBL903278)
Ki 0.6±n/a nM
Citation Neustadt, BRHao, JLindo, NGreenlee, WJStamford, AWTulshian, DOngini, EHunter, JMonopoli, ABertorelli, RFoster, CArik, LLachowicz, JNg, KFeng, KI Potent, selective, and orally active adenosine A2A receptor antagonists: arylpiperazine derivatives of pyrazolo[4,3-e]-1,2,4-triazolo[1,5-c]pyrimidines. Bioorg Med Chem Lett17:1376-80 (2007) 
 
Adenosine receptor A2a
Name:Adenosine receptor A2a
Type:G Protein-Coupled Receptor (GPCR)
Mol. Mass.:44716.46
Organism:Homo sapiens (Human)
Description:P29274
Residue:412
BDBM50202990
NameBDBM50202990
Synonyms:2-(furan-2-yl)-7-(2-(4-(4-(2-methoxyethoxy)phenyl)piperazin-1-yl)ethyl)-7H-pyrazolo[4,3-e][1,2,4]triazolo[1,5-c]pyrimidin-5-amine CHEMBL241109 | SCH-412348
TypeSmall organic molecule
Emp. Form.C22H21F2N9O
Mol. Mass.465.4586
SMILESNc1nc2n(CCN3CCN(CC3)c3ccc(F)cc3F)ncc2c2nc(nn12)-c1ccco1