Reaction Details
TargetMelanin-concentrating hormone receptor 1
LigandBDBM50203057
Substrate/Competitorn/a
Meas. Tech.ChEMBL_435559 (CHEMBL903918)
Ki 19±n/a nM
Citation Méndez-Andino, JLColson, AOMeyers, KMMitchell, MCHodge, KHoward, JMKim, NAckley, DCHolbert, JKMittelstadt, SWDowty, MEObringer, CMSuchanek, PReizes, OHu, XEWos, JA The efficacy and cardiac evaluation of aminomethyl tetrahydronaphthalene ketopiperazines: a novel class of potent MCH-R1 antagonists. Bioorg Med Chem15:2092-105 (2007) 
 
Melanin-concentrating hormone receptor 1
Name:Melanin-concentrating hormone receptor 1
Type:G Protein-Coupled Receptor (GPCR)
Mol. Mass.:45976.27
Organism:Homo sapiens (Human)
Description:Membranes from CHO-K1 cells stably expressing human MCH1R were used in assays.
Residue:422
BDBM50203057
NameBDBM50203057
Synonyms:4'-fluoro-biphenyl-4-carboxylic acid [2-(4-dimethylaminomethyl-phenyl)-ethyl]-amide | CHEMBL228987
TypeSmall organic molecule
Emp. Form.C24H25FN2O
Mol. Mass.376.4665
SMILESCN(C)Cc1ccc(CCNC(=O)c2ccc(cc2)-c2ccc(F)cc2)cc1