Reaction Details
TargetMelanin-concentrating hormone receptor 1
LigandBDBM50203064
Substrate/Competitorn/a
Meas. Tech.ChEMBL_435559 (CHEMBL903918)
Ki 4±n/a nM
Citation Méndez-Andino, JLColson, AOMeyers, KMMitchell, MCHodge, KHoward, JMKim, NAckley, DCHolbert, JKMittelstadt, SWDowty, MEObringer, CMSuchanek, PReizes, OHu, XEWos, JA The efficacy and cardiac evaluation of aminomethyl tetrahydronaphthalene ketopiperazines: a novel class of potent MCH-R1 antagonists. Bioorg Med Chem15:2092-105 (2007) 
 
Melanin-concentrating hormone receptor 1
Name:Melanin-concentrating hormone receptor 1
Type:G Protein-Coupled Receptor (GPCR)
Mol. Mass.:45976.27
Organism:Homo sapiens (Human)
Description:Membranes from CHO-K1 cells stably expressing human MCH1R were used in assays.
Residue:422
BDBM50203064
NameBDBM50203064
Synonyms:(S)-4-(4-bromophenethyl)-1-(6-((diethylamino)-methyl)-1,2,3,4-tetrahydronaphthalen-2-yl)piperazin-2-one | CHEMBL387990
TypeSmall organic molecule
Emp. Form.C27H36BrN3O
Mol. Mass.498.498
SMILESCCN(CC)Cc1ccc2C[C@H](CCc2c1)N1CCN(CCc2ccc(Br)cc2)CC1=O