Reaction Details
TargetB1 bradykinin receptor
LigandBDBM50203204
Substrate/Competitorn/a
Meas. Tech.ChEMBL_425210 (CHEMBL855156)
IC50 1700±n/a nM
Citation D'Amico, DCAya, THuman, JFotsch, CChen, JJBiswas, KRiahi, BNorman, MHWilloughby, CAHungate, RReider, PJBiddlecome, GLester-Zeiner, DStaden, CVJohnson, EKamassah, AArik, LWang, JViswanadhan, VNGroneberg, RDZhan, JSuzuki, HToro, AMareska, DAClarke, DEHarvey, DMBurgess, LELaird, ERAskew, BNg, G Identification of a nonpeptidic and conformationally restricted bradykinin B1 receptor antagonist with anti-inflammatory activity. J Med Chem50:607-10 (2007) 
 
B1 bradykinin receptor
Name:B1 bradykinin receptor
Type:Enzyme
Mol. Mass.:40508.87
Organism:Homo sapiens (Human)
Description:P46663
Residue:353
BDBM50203204
NameBDBM50203204
Synonyms:(S)-3-(naphthalene-7-sulfonamido)-3-phenyl-N-((S)-7-(piperidin-1-ylmethyl)chroman-4-yl)propanamide | CHEMBL385741
TypeSmall organic molecule
Emp. Form.C34H37N3O4S
Mol. Mass.583.74
SMILESO=C(C[C@H](NS(=O)(=O)c1ccc2ccccc2c1)c1ccccc1)N[C@H]1CCOc2cc(CN3CCCCC3)ccc12