Reaction Details
TargetB1 bradykinin receptor
LigandBDBM50203202
Substrate/Competitorn/a
Meas. Tech.ChEMBL_425211 (CHEMBL855157)
Ki 132±n/a nM
Citation D'Amico, DCAya, THuman, JFotsch, CChen, JJBiswas, KRiahi, BNorman, MHWilloughby, CAHungate, RReider, PJBiddlecome, GLester-Zeiner, DStaden, CVJohnson, EKamassah, AArik, LWang, JViswanadhan, VNGroneberg, RDZhan, JSuzuki, HToro, AMareska, DAClarke, DEHarvey, DMBurgess, LELaird, ERAskew, BNg, G Identification of a nonpeptidic and conformationally restricted bradykinin B1 receptor antagonist with anti-inflammatory activity. J Med Chem50:607-10 (2007) 
 
B1 bradykinin receptor
Name:B1 bradykinin receptor
Type:Enzyme
Mol. Mass.:40508.87
Organism:Homo sapiens (Human)
Description:P46663
Residue:353
BDBM50203202
NameBDBM50203202
Synonyms:(R)-N-(4-(piperidin-1-ylmethyl)benzyl)-3-(naphthalene-7-sulfonamido)-3-phenylpropanamide | CHEMBL426165
TypeSmall organic molecule
Emp. Form.C32H35N3O3S
Mol. Mass.541.704
SMILESO=C(C[C@@H](NS(=O)(=O)c1ccc2ccccc2c1)c1ccccc1)NCc1ccc(CN2CCCCC2)cc1