Reaction Details
TargetB2 bradykinin receptor
LigandBDBM50203208
Substrate/Competitorn/a
Meas. Tech.ChEMBL_425212 (CHEMBL855158)
Ki 15000±n/a nM
Citation D'Amico, DCAya, THuman, JFotsch, CChen, JJBiswas, KRiahi, BNorman, MHWilloughby, CAHungate, RReider, PJBiddlecome, GLester-Zeiner, DStaden, CVJohnson, EKamassah, AArik, LWang, JViswanadhan, VNGroneberg, RDZhan, JSuzuki, HToro, AMareska, DAClarke, DEHarvey, DMBurgess, LELaird, ERAskew, BNg, G Identification of a nonpeptidic and conformationally restricted bradykinin B1 receptor antagonist with anti-inflammatory activity. J Med Chem50:607-10 (2007) 
 
B2 bradykinin receptor
Name:B2 bradykinin receptor
Type:Enzyme Catalytic Domain
Mol. Mass.:44467.17
Organism:Homo sapiens (Human)
Description:B2 BRADYKININ BDKRB2 HUMAN::P30411
Residue:391
BDBM50203208
NameBDBM50203208
Synonyms:(R)-3-(naphthalene-7-sulfonamido)-3-phenyl-N-((S)-6-(piperidin-1-ylmethyl)-1,2,3,4-tetrahydronaphthalen-1-yl)propanamide | CHEMBL415629
TypeSmall organic molecule
Emp. Form.C35H39N3O3S
Mol. Mass.581.767
SMILESO=C(C[C@@H](NS(=O)(=O)c1ccc2ccccc2c1)c1ccccc1)N[C@H]1CCCc2cc(CN3CCCCC3)ccc12