Reaction Details
TargetB1 bradykinin receptor
LigandBDBM50203206
Substrate/Competitorn/a
Meas. Tech.ChEMBL_425210 (CHEMBL855156)
IC50 302±n/a nM
Citation D'Amico, DCAya, THuman, JFotsch, CChen, JJBiswas, KRiahi, BNorman, MHWilloughby, CAHungate, RReider, PJBiddlecome, GLester-Zeiner, DStaden, CVJohnson, EKamassah, AArik, LWang, JViswanadhan, VNGroneberg, RDZhan, JSuzuki, HToro, AMareska, DAClarke, DEHarvey, DMBurgess, LELaird, ERAskew, BNg, G Identification of a nonpeptidic and conformationally restricted bradykinin B1 receptor antagonist with anti-inflammatory activity. J Med Chem50:607-10 (2007) 
 
B1 bradykinin receptor
Name:B1 bradykinin receptor
Type:Enzyme
Mol. Mass.:40508.87
Organism:Homo sapiens (Human)
Description:P46663
Residue:353
BDBM50203206
NameBDBM50203206
Synonyms:(R)-3-(naphthalene-3-sulfonamido)-3-phenyl-N-((R)-1-(4-(piperidin-1-ylmethyl)phenyl)ethyl)propanamide | CHEMBL221925
TypeSmall organic molecule
Emp. Form.C33H37N3O3S
Mol. Mass.555.73
SMILESC[C@@H](NC(=O)C[C@@H](NS(=O)(=O)c1ccc2ccccc2c1)c1ccccc1)c1ccc(CN2CCCCC2)cc1