Reaction Details
TargetB2 bradykinin receptor
LigandBDBM50203199
Substrate/Competitorn/a
Meas. Tech.ChEMBL_425212 (CHEMBL855158)
Ki 35000±n/a nM
Citation D'Amico, DCAya, THuman, JFotsch, CChen, JJBiswas, KRiahi, BNorman, MHWilloughby, CAHungate, RReider, PJBiddlecome, GLester-Zeiner, DStaden, CVJohnson, EKamassah, AArik, LWang, JViswanadhan, VNGroneberg, RDZhan, JSuzuki, HToro, AMareska, DAClarke, DEHarvey, DMBurgess, LELaird, ERAskew, BNg, G Identification of a nonpeptidic and conformationally restricted bradykinin B1 receptor antagonist with anti-inflammatory activity. J Med Chem50:607-10 (2007) 
 
B2 bradykinin receptor
Name:B2 bradykinin receptor
Type:Enzyme Catalytic Domain
Mol. Mass.:44467.17
Organism:Homo sapiens (Human)
Description:B2 BRADYKININ BDKRB2 HUMAN::P30411
Residue:391
BDBM50203199
NameBDBM50203199
Synonyms:(R)-3-(naphthalene-7-sulfonamido)-3-phenyl-N-((R)-7-(piperidin-1-ylmethyl)-2,2-dioxo-1,2,3,4-tetrahydro-1-methyl-2,1-benzothiazine-4-yl)propanamide | CHEMBL373654
TypeSmall organic molecule
Emp. Form.C34H38N4O5S2
Mol. Mass.646.819
SMILESCN1c2cc(CN3CCCCC3)ccc2[C@H](CS1(=O)=O)NC(=O)C[C@@H](NS(=O)(=O)c1ccc2ccccc2c1)c1ccccc1