Reaction Details
TargetGlutamate receptor ionotropic, NMDA 2B
LigandBDBM50203317
Substrate/Competitorn/a
Meas. Tech.ChEMBL_425253 (CHEMBL856830)
Ki 220±n/a nM
Citation Liverton, NJBednar, RABednar, BButcher, JWClaiborne, CFClaremon, DACunningham, MDiLella, AGGaul, SLLibby, BELyle, EALynch, JJMcCauley, JAMosser, SDNguyen, KTStump, GLSun, HWang, HYergey, JKoblan, KS Identification and characterization of 4-methylbenzyl 4-[(pyrimidin-2-ylamino)methyl]piperidine-1-carboxylate, an orally bioavailable, brain penetrant NR2B selective N-methyl-D-aspartate receptor antagonist. J Med Chem50:807-19 (2007) 
 
Glutamate receptor ionotropic, NMDA 2B
Name:Glutamate receptor ionotropic, NMDA 2B
Type:PROTEIN
Mol. Mass.:166375.46
Organism:Homo sapiens (Human)
Description:ChEMBL_1438829
Residue:1484
BDBM50203317
NameBDBM50203317
Synonyms:CHEMBL218546 | benzyl 4-(1H-benzimidazol-2-ylmethyl)piperidine-1-carboxylate
TypeSmall organic molecule
Emp. Form.C21H23N3O2
Mol. Mass.349.4262
SMILESO=C(OCc1ccccc1)N1CCC(Cc2nc3ccccc3[nH]2)CC1