Reaction Details
TargetGlutamate receptor ionotropic, NMDA 2B
LigandBDBM50203320
Substrate/Competitorn/a
Meas. Tech.ChEMBL_425253 (CHEMBL856830)
Ki 206±n/a nM
Citation Liverton, NJBednar, RABednar, BButcher, JWClaiborne, CFClaremon, DACunningham, MDiLella, AGGaul, SLLibby, BELyle, EALynch, JJMcCauley, JAMosser, SDNguyen, KTStump, GLSun, HWang, HYergey, JKoblan, KS Identification and characterization of 4-methylbenzyl 4-[(pyrimidin-2-ylamino)methyl]piperidine-1-carboxylate, an orally bioavailable, brain penetrant NR2B selective N-methyl-D-aspartate receptor antagonist. J Med Chem50:807-19 (2007) 
 
Glutamate receptor ionotropic, NMDA 2B
Name:Glutamate receptor ionotropic, NMDA 2B
Type:PROTEIN
Mol. Mass.:166375.46
Organism:Homo sapiens (Human)
Description:ChEMBL_1438829
Residue:1484
BDBM50203320
NameBDBM50203320
Synonyms:3-methylbenzyl 4-[(2-pyrimidinylamino)methyl]-1-piperidinecarboxylate | CHEMBL218104
TypeSmall organic molecule
Emp. Form.C19H24N4O2
Mol. Mass.340.4195
SMILESCc1cccc(COC(=O)N2CCC(CNc3ncccn3)CC2)c1