Reaction Details
TargetCaspase-3
LigandBDBM50203364
Substrate/Competitorn/a
Meas. Tech.ChEMBL_454170 (CHEMBL903359)
IC50 6.6±n/a nM
Citation Isabel, EAspiotis, RBlack, WCColucci, JFortin, RGiroux, AGrimm, ELHan, YMellon, CNicholson, DWRasper, DMRenaud, JRoy, STam, JTawa, PVaillancourt, JPXanthoudakis, SZamboni, RJ Solid-phase analogue synthesis of caspase-3 inhibitors via palladium-catalyzed amination of 3-bromopyrazinones. Bioorg Med Chem Lett17:1671-4 (2007) 
 
Caspase-3
Name:Caspase-3
Type:Hydrolase; heterotetramer of two heterodimers
Mol. Mass.:31607.55
Organism:Homo sapiens (Human)
Description:n/a
Residue:277
BDBM50203364
NameBDBM50203364
Synonyms:CHEMBL248310 | N-((S)-3-(2-(3-(1H-tetrazol-5-ylamino)-5-tert-butyl-2-oxopyrazin-1(2H)-yl)butanamido)-4-carboxy-2-oxobutyl)-N-methylhexan-1-aminium 2,2,2-trifluoroacetate
TypeSmall organic molecule
Emp. Form.C25H42N9O5
Mol. Mass.548.6577
SMILESCCCCCC[NH+](C)CC(=O)[C@H](CC(O)=O)NC(=O)C(CC)n1cc(nc(Nc2nnn[nH]2)c1=O)C(C)(C)C