Reaction Details
TargetAlpha-1D adrenergic receptor
LigandBDBM50203481
Substrate/Competitorn/a
Meas. Tech.ChEMBL_441869 (CHEMBL891020)
Ki 0.2±n/a nM
Citation Li, SChiu, GPulito, VLLiu, JConnolly, PJMiddleton, SA 1-Arylpiperazinyl-4-cyclohexylamine derived isoindole-1,3-diones as potent and selective alpha-1a/1d adrenergic receptor ligands. Bioorg Med Chem Lett17:1646-50 (2007) 
 
Alpha-1D adrenergic receptor
Name:Alpha-1D adrenergic receptor
Type:Enzyme Catalytic Domain
Mol. Mass.:60485.82
Organism:Homo sapiens (Human)
Description:adrenergic Alpha1D ADRA1D HUMAN::P25100
Residue:572
BDBM50203481
NameBDBM50203481
Synonyms:2-(4-(4-(2-isopropoxyphenyl)piperazin-1-yl)cyclohexyl)-2H-benzo[e]isoindole-1,3-dione | CHEMBL243864
TypeSmall organic molecule
Emp. Form.C31H35N3O3
Mol. Mass.497.6279
SMILESCC(C)Oc1ccccc1N1CCN(CC1)C1CCC(CC1)N1C(=O)c2ccc3ccccc3c2C1=O