Reaction Details
TargetAlpha-1A adrenergic receptor
LigandBDBM82517
Substrate/Competitorn/a
Meas. Tech.ChEMBL_441867 (CHEMBL891018)
Ki 0.26±n/a nM
Citation Li, SChiu, GPulito, VLLiu, JConnolly, PJMiddleton, SA 1-Arylpiperazinyl-4-cyclohexylamine derived isoindole-1,3-diones as potent and selective alpha-1a/1d adrenergic receptor ligands. Bioorg Med Chem Lett17:1646-50 (2007) 
 
Alpha-1A adrenergic receptor
Name:Alpha-1A adrenergic receptor
Type:Cell-surface receptors
Mol. Mass.:51511.67
Organism:Homo sapiens (Human)
Description:P35348
Residue:466
BDBM82517
NameBDBM82517
Synonyms:2-{4-[4-(2-Methoxy-phenyl)-piperazin-1-yl]-butyl}-isoindole-1,3-dione CHEMBL126632 NAN-190 | NSC_107966
TypeSmall organic molecule
Emp. Form.C23H27N3O3
Mol. Mass.393.4788
SMILESCOc1ccccc1N1CCN(CCCCN2C(=O)c3ccccc3C2=O)CC1