Reaction Details
TargetCarbonic anhydrase 1
LigandBDBM26994
Substrate/Competitorn/a
Meas. Tech.ChEMBL_458925 (CHEMBL924944)
Ki 21000±n/a nM
Citation Innocenti, AVullo, DPastorek, JScozzafava, APastorekova, SNishimori, ISupuran, CT Carbonic anhydrase inhibitors. Inhibition of transmembrane isozymes XII (cancer-associated) and XIV with anions. Bioorg Med Chem Lett17:1532-7 (2007) 
 
Carbonic anhydrase 1
Name:Carbonic anhydrase 1
Type:Enzyme
Mol. Mass.:28873.37
Organism:Homo sapiens (Human)
Description:P00915
Residue:261
BDBM26994
NameBDBM26994
Synonyms:CHEMBL68253 sulfamic acid
Typen/a
Emp. Form.H3NO3S
Mol. Mass.97.094
SMILESNS(O)(=O)=O