Reaction Details
TargetCarbonic anhydrase 14
LigandBDBM26997
Substrate/Competitorn/a
Meas. Tech.ChEMBL_458929 (CHEMBL924948)
Ki 84000±n/a nM
Citation Innocenti, AVullo, DPastorek, JScozzafava, APastorekova, SNishimori, ISupuran, CT Carbonic anhydrase inhibitors. Inhibition of transmembrane isozymes XII (cancer-associated) and XIV with anions. Bioorg Med Chem Lett17:1532-7 (2007) 
 
Carbonic anhydrase 14
Name:Carbonic anhydrase 14
Type:Enzyme
Mol. Mass.:37665.67
Organism:Homo sapiens (Human)
Description:Human (cloned) isozyme.
Residue:337
BDBM26997
NameBDBM26997
Synonyms:CHEMBL364571 benzenarsonic acid phenylarsonic acid
Typen/a
Emp. Form.C6H7AsO3
Mol. Mass.202.0396
SMILESO[As](O)(=O)c1ccccc1