Reaction Details
TargetCarbonic anhydrase 9
LigandBDBM26995
Substrate/Competitorn/a
Meas. Tech.ChEMBL_458927 (CHEMBL924946)
Ki 96000±n/a nM
Citation Innocenti, AVullo, DPastorek, JScozzafava, APastorekova, SNishimori, ISupuran, CT Carbonic anhydrase inhibitors. Inhibition of transmembrane isozymes XII (cancer-associated) and XIV with anions. Bioorg Med Chem Lett17:1532-7 (2007) 
 
Carbonic anhydrase 9
Name:Carbonic anhydrase 9
Type:Enzyme
Mol. Mass.:49669.03
Organism:Homo sapiens (Human)
Description:Catalytic domain of human cloned isozyme was used in the assay
Residue:459
BDBM26995
NameBDBM26995
Synonyms:CHEMBL355001 sulfamamide sulfamoylamine
Typen/a
Emp. Form.H4N2O2S
Mol. Mass.96.109
SMILESNS(N)(=O)=O