Reaction Details
TargetSphingosine 1-phosphate receptor 3
LigandBDBM50203766
Substrate/Competitorn/a
Meas. Tech.ChEMBL_425682 (CHEMBL911998)
IC50>20000±n/a nM
Citation Koide, YUemoto, KHasegawa, TSada, TMurakami, ATakasugi, HSakurai, AMochizuki, NTakahashi, ANishida, A Pharmacophore-based design of sphingosine 1-phosphate-3 receptor antagonists that include a 3,4-dialkoxybenzophenone scaffold. J Med Chem50:442-54 (2007) 
 
Sphingosine 1-phosphate receptor 3
Name:Sphingosine 1-phosphate receptor 3
Type:G Protein-Coupled Receptor (GPCR)
Mol. Mass.:42278.13
Organism:Homo sapiens (Human)
Description:Q99500
Residue:378
BDBM50203766
NameBDBM50203766
Synonyms:(4R)-2-(3-((4-chloro-2-isopropyl-6-methylphenoxy)methyl)-4-methoxyphenyl)thiazolidine-4-carboxylic acid | CHEMBL218126
TypeSmall organic molecule
Emp. Form.C22H26ClNO4S
Mol. Mass.435.964
SMILESCOc1ccc(cc1COc1c(C)cc(Cl)cc1C(C)C)C1N[C@@H](CS1)C(O)=O