Reaction Details
TargetSphingosine 1-phosphate receptor 3
LigandBDBM50203775
Substrate/Competitorn/a
Meas. Tech.ChEMBL_425682 (CHEMBL911998)
IC50 3570±n/a nM
Citation Koide, YUemoto, KHasegawa, TSada, TMurakami, ATakasugi, HSakurai, AMochizuki, NTakahashi, ANishida, A Pharmacophore-based design of sphingosine 1-phosphate-3 receptor antagonists that include a 3,4-dialkoxybenzophenone scaffold. J Med Chem50:442-54 (2007) 
 
Sphingosine 1-phosphate receptor 3
Name:Sphingosine 1-phosphate receptor 3
Type:G Protein-Coupled Receptor (GPCR)
Mol. Mass.:42278.13
Organism:Homo sapiens (Human)
Description:Q99500
Residue:378
BDBM50203775
NameBDBM50203775
Synonyms:(Z)-5-[1-(4-cetyloxy-3-methoxyphenyl)-1-phenylmethylene]-sulfohydrazono isophthalic acid | CHEMBL218446
TypeSmall organic molecule
Emp. Form.C38H50N2O8S
Mol. Mass.694.877
c1ccc(cc1OC)C(=N/NS(=O)(=O)c1cc(cc(c1)C(O)=O)C(O)=O)\c1ccccc1