Reaction Details
TargetC-C chemokine receptor type 8
LigandBDBM50203837
Substrate/Competitorn/a
Meas. Tech.ChEMBL_425772 (CHEMBL855762)
Ki 4.4±n/a nM
Citation Jenkins, TJGuan, BDai, MLi, GLightburn, TEHuang, SFreeze, BSBurdi, DFJacutin-Porte, SBennett, RChen, WMinor, CGhosh, SBlackburn, CGigstad, KMJones, MKolbeck, RYin, WSmith, SCardillo, DOcain, TDHarriman, GC Design, synthesis, and evaluation of naphthalene-sulfonamide antagonists of human CCR8. J Med Chem50:566-84 (2007) 
 
C-C chemokine receptor type 8
Name:C-C chemokine receptor type 8
Type:PROTEIN
Mol. Mass.:40855.53
Organism:Homo sapiens (Human)
Description:ChEMBL_454278
Residue:355
BDBM50203837
NameBDBM50203837
Synonyms:CHEMBL218503 | N-(4-cyclohexylsulfamoyl-naphthalen-1-yl)-benzamide
TypeSmall organic molecule
Emp. Form.C23H24N2O3S
Mol. Mass.408.513
SMILESO=C(Nc1ccc(c2ccccc12)S(=O)(=O)NC1CCCCC1)c1ccccc1